[AMBER] Error during installation

From: ARITRA MITRA <aritra18.iitg.ac.in>
Date: Tue, 24 Dec 2019 09:23:12 +0000

Dear all,
I am getting the following errors while installing Amber 14 in my Ubuntu 18.04 LTS system:

Makefile:33: recipe for target 'GraphToHoldScores.o' failed
make[3]: *** [GraphToHoldScores.o] Error 1
make[3]: Leaving directory '/home/aritra/AMBER/amber14/AmberTools/src/reduce/reduce_src'
Makefile:19: recipe for target 'install' failed
make[2]: *** [install] Error 2
make[2]: Leaving directory '/home/aritra/AMBER/amber14/AmberTools/src/reduce'
Makefile:16: recipe for target 'serial' failed
make[1]: *** [serial] Error 2
make[1]: Leaving directory '/home/aritra/AMBER/amber14/AmberTools/src'
Makefile:7: recipe for target 'install' failed
make: *** [install] Error 2

Please help me out.

Thanks in advance.


Aritra Mitra,

c/o- Prof. Sandip Paul

Junior Research Fellow,

Department of Chemistry,

IIT Guwahati.

AMBER mailing list
Received on Tue Dec 24 2019 - 01:30:02 PST
Custom Search