[AMBER] AmberTools installation error

From: Jennifer L. Muzyka <jennifer.muzyka.centre.edu>
Date: Wed, 6 Jul 2011 12:08:58 +0000

We're trying to install AmberTools 1.5 on a Mac running OSX 10.5. When we get enter "make install", we get the following error:
../../src/eigen3b2/Eigen/src/Core/arch/AltiVec/Complex.h:137:30: error: 'sum' was not declared in this scope
make[3]: *** [sheet.lo] Error 1
make[2]: *** [install-recursive] Error 1
make[1]: *** [install-recursive] Error 1
make: *** [install_mtkpp] Error 2

We'd appreciate advice about what these errors mean and so that we can proceed with installing Amber 11. Thanks.

Jennifer L. Muzyka
Professor of Chemistry
Centre College
600 West Walnut Street
Danville, KY 40422


AMBER mailing list
Received on Wed Jul 06 2011 - 05:30:04 PDT
Custom Search