Re: [AMBER] compilation aborted for ncsu-umbrella.F90 (code 1)

From: David A Case <>
Date: Tue, 23 Oct 2012 09:18:41 -0400

On Tue, Oct 23, 2012, hari krishna wrote:

> (2947): catastrophic error: Too many errors, exiting
> compilation aborted for ncsu-umbrella.F90 (code 1)
> make[2]: *** [ncsu-umbrella.o] Error 1
> make[2]: Leaving directory `/home/p_kumar/amber12/src/sander'
> make[1]: *** [parallel] Error 2
> make[1]: Leaving directory `/home/p_kumar/amber12/src'
> make: *** [install] Error 2

The real error is earlier in the log file:

ncsu-umbrella.F90(9): error #7013: This module file was not generated by any
+release of this compiler. [NETCDF]

It looks like(?) you may have previously used a different compiler. Or that
the compiler that mpif90 uses is not the same compiler as config.h is
referring to. Look at the output for "mpif90 -show" and make sure that it is
what you want it to be. You might also try typing "make clean" before
re-compiling (although I rather doubt that will help here.)

...good luck...dac

AMBER mailing list
Received on Tue Oct 23 2012 - 06:30:04 PDT
Custom Search