Re: [AMBER] amber20 installation failed on ubuntu

From: David A Case via AMBER <>
Date: Thu, 16 Feb 2023 21:29:12 -0500

On Thu, Feb 16, 2023, Renato Freitas via AMBER wrote:
>error: command '/usr/bin/gcc' failed with exit code 1
>make[2]: *** [AmberTools/src/pytraj/CMakeFiles/pytraj.dir/build.make:522:
>AmberTools/src/pytraj/CMakeFiles/python-build/pytraj-build.stamp] Error 1
>make[1]: *** [CMakeFiles/Makefile2:6738:
>AmberTools/src/pytraj/CMakeFiles/pytraj.dir/all] Error 2
>make: *** [Makefile:152: all] Error 2

This is only the very end of a long (several hundred line) error message.
I have no clue about what is going on. You might try opening an issue

As workaround, try adding -DDISABLE_TOOLS="pytraj" to your run_cmake script,
run that script and try another "make install".

...good luck...dac

AMBER mailing list
Received on Thu Feb 16 2023 - 18:30:03 PST
Custom Search