Re: AMBER: problem in compiling amber9 and running amber9

From: Mark Williamson <>
Date: Sat, 21 Jul 2007 15:21:18 +0100

Prem Prakash Pathak wrote:
> Hi
> I am working on LINUX SuSE 9.1 .I have amber9 package. I have g95
> compiler.To check i do this
> drinmr1.drinmr1:~> g95
> g95: no input files

Out of interest, what version of g95 is this?

> WcActCB.c:1432: error: parse error before "XEvent"
> WcActCB.c:1432: error: parse error before "Cardinal"
> WcActCB.c:1536: error: parse error before '}' token
> WcActCB.c:1538: error: parse error before '(' token
> WcCreateP.h:253: warning: array `wcWidgetCvtArgs' assumed to have one
> element
You need to install the x11-devel package. I'm not sure of its exact rpm
name under SuSE.

> cd qmmm2/MG_QM_water_MM_AM1_periodic; ./Run.notimaged_md
> diffing with mdout.notimaged_md
> possible FAILURE: check mdout.notimaged_md.dif

Did you follow the advice of the warning and check
mdout.notimaged_md.dif ? It would be useful to see this.

Have you installed the recent bugfixes ( ) ?

> cd leap; ./Run.tleap
> Error: ./tleap -> ../../exe/teLeap does not exist
> make: *** [test.leap] Error 1
> drinmr1.drinmr1:~/amber9/test>

tleap probably did not compile because the compile process was
interrupted above due to the lack of the x11-devel package.


Mark Williamson

The AMBER Mail Reflector
To post, send mail to
To unsubscribe, send "unsubscribe amber" to
Received on Sun Jul 22 2007 - 06:08:01 PDT
Custom Search